{"text_format":"1","workbook":"xlsx","n_sheets":3,"sheets":["Instructions","Dashboard","Solar"],"not_rendered":{"charts":2,"images":3,"macros":1,"external_links":0,"defined_names":0,"comments":0,"pivot_tables":0},"unopened":[],"bounds":{"document_bytes":16777216,"sheet_cells":100000,"rows_first":2000,"rows_last":500,"rows_between":2000,"halvings":0,"cell_chars":16384,"cell_head_chars":4096},"cells_cut":0,"cells_raw":0,"read":"whole","date_system":"1900"}

{"sheet":"Instructions","index":0,"n_rows":39,"n_cols":2,"rows_kept":39,"cut":false,"hidden":false,"merged":[[35,1,35,3]]}
[]
[null,"Renewables First"]
[]
[]
[]
[]
[]
[]
[]
[]
[null,"Purpose"]
[null,"-The LCOE Tariff Calculator is designed  to help energy sector stakeholders calculate accurate lifetime energy cost of power generation technologies. "]
[null,"-It makes complex financial analysis accessible to everyone from developers to policymakers."]
[]
[null,"Description"]
[null,"-This tool determines the total cost per unit of electricity for a utility scale solar power plant with a 25 year PPA. "]
[null,"-It factors in all major costs (capital, operations, maintenance), includes financial parameters (discount rates, capital structure), and provides detailed analysis with technology-specific considerations."]
[null,"-Uses industry-standard methods for reliable results."]
[]
[null,"Note"]
[null,"-This workbook requires both Macros and Iterative Calculations to function properly."]
[]
[null,"-To Enable Macros:\n1. Look for the yellow security warning at the top of Excel\n2. Click \"Enable Content\" or \"Enable Macros\""]
[]
[null,"-If Macros are Disabled at Security Level:\n1. Go to File > Options > Trust Center\n2. Click \"Trust Center Settings\"\n3. Select \"Macro Settings\"\n4. Choose \"Enable all macros\" "]
[]
[null,"-To Manually Enable Iterations (if needed):\n1. Go to File > Options\n2. Click \"Formulas\"\n3. Check \"Enable iterative calculation\"\n4. Set Maximum Iterations to 100\n5. Set Maximum Change to 0.001"]
[]
[null,"Disclaimer"]
[null,"-Results depend on input accuracy"]
[null,"-Uses standardized assumptions that may differ from local conditions"]
[null,"-Future projections carry inherent uncertainties"]
[null,"-Not meant as financial advice"]
[null,"-No liability accepted for decisions based on results"]
[null,"-Uses simplified models suitable for general planning"]
[]
[]
[]
[null,"2025 Renewables First. All Rights Reserved.\nDeveloped by Ahtasam Ahmad\n\nThis work is proprietary and confidential. No part of this document may be reproduced, distributed, or transmitted in any form or by any means, without the prior written permission of Renewables First. Unauthorized use, reproduction, or distribution may result in legal action.\n\nFor permissions and inquiries, please contact:\nRenewables First\n+92 51 88773676\ninfo@renewablesfirst.org"]

{"sheet":"Dashboard","index":1,"n_rows":51,"n_cols":34,"rows_kept":51,"cut":false,"hidden":false,"merged":[[1,2,1,3],[1,0,1,1],[2,0,2,1],[3,0,3,1],[8,0,8,3]]}
[]
[null,null,"Solar - 25 year PPA "]
["Levelized Tariff",null,"US cents",{"$f":"IF(OR(D23>48,D41>25,D44>25),\"False Entry\",Solar!D6)","v":3.6224140907000955},null,null,null,null,null,null,null,null,null,null,null,null,null,null,null,null,null,null,null,null,null,null,null,null,null,null,null,null,"Levelized Tariff Solar"]
[null,null,"Rs./kWh",{"$f":"D3*D47/100","v":10.070311172146265}]
[]
[]
["This workbook requires Macros to run. Enable Macros by clicking \"Enable Content\" in the security warning bar. The macro will automatically enable iteration settings. If calculation errors persist e.g. \"Microsoft has blocked macros from running,\" manually enable iteration in File > Options > Formulas > Enable iterative calculation. For detailed steps, refer to the instructions sheet. "]
[]
["Please populate the following  fields with project particulars to calculate the LCOE"]
[]
["Generation",null,null,null,null,null,null,null,null,null,null,null,null,null,null,null,null,null,null,null,null,null,null,null,null,null,null,null,null,null,null,null,2015,14.2]
["Capacity (MW) (Name Plate Capacity)",null,null,120,null,null,null,null,null,null,null,null,null,null,null,null,null,null,null,null,null,null,null,null,null,null,null,null,null,null,null,null,2016,13.4]
["Capacity Factor (Based On Technical Feasibility)",null,"%",0.24,null,null,null,null,null,null,null,null,null,null,null,null,null,null,null,null,null,null,null,null,null,null,null,null,null,null,null,null,2017,13.4]
[null,null,null,null,null,null,null,null,null,null,null,null,null,null,null,null,null,null,null,null,null,null,null,null,null,null,null,null,null,null,null,null,2018,11.6]
["Project Cost in USD - Million (M)",null,null,null,null,null,null,null,null,null,null,null,null,null,null,null,null,null,null,null,null,null,null,null,null,null,null,null,null,null,null,null,2019,12]
[null,null,null,null,null,null,null,null,null,null,null,null,null,null,null,null,null,null,null,null,null,null,null,null,null,null,null,null,null,null,null,null,2020,5.5]
["Engineering & Procurement Cost (E.g. PV Modules, Buildings, Balance of Plant, Cabling, Trackers, Inverters etc.)",null,"USD'M/MW",0.42,null,null,null,null,null,null,null,null,null,null,null,null,null,null,null,null,null,null,null,null,null,null,null,null,null,null,null,null,2021,5.5]
["Degradation",null,"% of EPC",0.03,null,null,null,null,null,null,null,null,null,null,null,null,null,null,null,null,null,null,null,null,null,null,null,null,null,null,null,null,2022,3.7]
["Project Development Cost (E.g. Feasibility Study, Advisors & Consultant Fee etc.)",null,"% of EPC",0.02,null,null,null,null,null,null,null,null,null,null,null,null,null,null,null,null,null,null,null,null,null,null,null,null,null,null,null,null,2023,3.9]
["Land",null,"USD'M",2.75,null,null,null,null,null,null,null,null,null,null,null,null,null,null,null,null,null,null,null,null,null,null,null,null,null,null,null,null,"Solar Tariff - New",{"$f":"D3","v":3.6224140907000955}]
["Insurance During the Project Construction Period",null,"% of EPC",4.0000000000000001E-3]
["Financing Fees",null,"% of Debt",0.02]
["Construction Period",null,"Months",10,"Not more than 48 months"]
[]
["Capital Structure",null,null,null,null,null,null,null,null,null,null,null,null,null,null,null,null,null,null,null,null,null,null,null,null,null,null,null,null,null,null,null,null,1]
[null,null,null,null,null,null,null,null,null,null,null,null,null,null,null,null,null,null,null,null,null,null,null,null,null,null,null,null,null,null,null,null,null,2]
["Debt as a % of Total Project Capital Expenditure",null,null,0.75,null,null,null,null,null,null,null,null,null,null,null,null,null,null,null,null,null,null,null,null,null,null,null,null,null,null,null,null,null,3]
["Equity",null,null,{"$f":"1-D27","v":0.25},null,null,null,null,null,null,null,null,null,null,null,null,null,null,null,null,null,null,null,null,null,null,null,null,null,null,null,null,null,4]
[]
["% of Debt Sourced From Foreign Lenders",null,null,0.5,null,null,null,null,null,null,null,null,null,null,null,null,null,null,null,null,null,null,null,null,null,null,null,null,null,null,null,null,null,5]
["% of Local Debt",null,null,{"$f":"1-D30","v":0.5}]
[null,null,null,null,null,null,null,null,null,null,null,null,null,null,null,null,null,null,null,null,null,null,null,null,null,null,null,null,null,null,null,null,null,6]
["Operational",null,null,null,null,null,null,null,null,null,null,null,null,null,null,null,null,null,null,null,null,null,null,null,null,null,null,null,null,null,null,null,null,7]
[null,null,null,null,null,null,null,null,null,null,null,null,null,null,null,null,null,null,null,null,null,null,null,null,null,null,null,null,null,null,null,null,null,8]
["Fixed Operations & Maintenance",null,"USD/MW",9000,null,null,null,null,null,null,null,null,null,null,null,null,null,null,null,null,null,null,null,null,null,null,null,null,null,null,null,null,null,9]
["Insurance During Project's Tenor",null,"% of EPC",4.0000000000000001E-3,null,null,null,null,null,null,null,null,null,null,null,null,null,null,null,null,null,null,null,null,null,null,null,null,null,null,null,null,null,10]
[null,null,null,null,null,null,null,null,null,null,null,null,null,null,null,null,null,null,null,null,null,null,null,null,null,null,null,null,null,null,null,null,null,11]
["Financing and other assumptions",null,null,null,null,null,null,null,null,null,null,null,null,null,null,null,null,null,null,null,null,null,null,null,null,null,null,null,null,null,null,null,null,12]
[null,null,null,null,null,null,null,null,null,null,null,null,null,null,null,null,null,null,null,null,null,null,null,null,null,null,null,null,null,null,null,null,null,13]
["Local Financing Rate",null,null,0.15,null,null,null,null,null,null,null,null,null,null,null,null,null,null,null,null,null,null,null,null,null,null,null,null,null,null,null,null,null,14]
{"$rows_left_out":12}
{"sheet":"Solar","index":2,"n_rows":173,"n_cols":38,"rows_kept":173,"cut":false,"hidden":true,"merged":[[68,20,68,32]]}
[null,null,"Solar "]
[null,null,null,null,null,null,null,null,null,null,null,null,null,null,null,null,null,null,null,null,null,"Solar"]
["Capacity (MW)",null,null,{"$f":"Dashboard!D12","v":120}]
["Capacity Factor",null,null,{"$f":"Dashboard!D13","v":0.24},null,null,null,null,null,null,null,null,null,null,null,null,null,null,null,null,null,"IDC",null,null,null,null,null,null,null,null,null,null,null,"ROEDC"]
["Generation (MWh)",null,null,{"$f":"D4*(365*24)*D3","v":252288}]
["Levelized Tariff","US cents",null,{"$f":"L79","v":3.6224140907000955},null,null,null,null,null,null,null,null,null,null,null,null,null,null,null,null,null,"Local","USD'm",{"$f":"D28","v":22.200635761589403},null,null,null,"Foreign","USD'm",{"$f":"D27","v":22.200635761589403},null,null,null,null,"USD'm",{"$f":"D29","v":14.800423841059603}]
[null,"Rs./kWh"]
[]
["Project Cost (in USD'm)",null,null,null,null,null,null,null,null,null,"Financing and other assumptions",null,null,null,null,null,null,null,null,null,null,"Months","Opening Debt","Drawdown","IDC","Closing",null,"Months","Opening Debt","Drawdown","IDC","Closing",null,"Months","Opening Debt","Drawdown","ROE","Closing"]
[null,null,"Per MW","Total",null,null,null,null,null,null,null,null,null,null,null,null,null,null,null,null,null,1,0,{"$f":"IF(V10>$D$22,0,$X$6/$D$22)","v":2.2200635761589402},{"$f":"SUM(W10:X10)*($O$13/12)","v":2.7750794701986752E-2},{"$f":"W10+X10","v":2.2200635761589402},null,1,0,{"$f":"IF(AB10>$D$22,0,$AD$6/$D$22)","v":2.2200635761589402},{"$f":"SUM(AC10:AD10)*($O$20/12)","v":1.6650476821192053E-2},{"$f":"AC10+AD10","v":2.2200635761589402},null,1,0,{"$f":"IF(AH10>$D$22,0,$AJ$6/$D$22)","v":1.4800423841059602},{"$f":"SUM(AI10:AJ10)*($O$24/12)","v":1.726716114790287E-2},{"$f":"AI10+AJ10","v":1.4800423841059602}]
["EPC Cost",null,{"$f":"Dashboard!D17","v":0.42},{"$f":"C11*D3","v":50.4},null,null,null,null,null,null,"KIBOR",null,null,"base",0.12,null,null,null,null,null,null,{"$f":"V10+1","v":2},{"$f":"IF(V11>$D$22,0,Z10)","v":2.2200635761589402},{"$f":"IF(V11>$D$22,0,$X$6/$D$22)","v":2.2200635761589402},{"$f":"SUM(W11:X11)*($O$13/12)","v":5.5501589403973504E-2},{"$f":"W11+X11","v":4.4401271523178805},null,{"$f":"AB10+1","v":2},{"$f":"IF(AB11>$D$22,0,AF10)","v":2.2200635761589402},{"$f":"IF(AB11>$D$22,0,$AD$6/$D$22)","v":2.2200635761589402},{"$f":"SUM(AC11:AD11)*($O$20/12)","v":3.3300953642384105E-2},{"$f":"AC11+AD11","v":4.4401271523178805},null,{"$f":"AH10+1","v":2},{"$f":"IF(AH11>$D$22,0,AL10)","v":1.4800423841059602},{"$f":"IF(AH11>$D$22,0,$AJ$6/$D$22)","v":1.4800423841059602},{"$f":"SUM(AI11:AJ11)*($O$24/12)","v":3.453432229580574E-2},{"$f":"AI11+AJ11","v":2.9600847682119205}]
["Degradation",{"$f":"Dashboard!D18","v":0.03},null,{"$f":"B12*D11","v":1.512},null,null,null,null,null,null,"Spread",null,null,null,2.5000000000000001E-2,null,null,null,null,null,null,3,{"$f":"IF(V12>$D$22,0,Z11)","v":4.4401271523178805},{"$f":"IF(V12>$D$22,0,$X$6/$D$22)","v":2.2200635761589402},{"$f":"SUM(W12:X12)*($O$13/12)","v":8.3252384105960253E-2},{"$f":"W12+X12","v":6.6601907284768203},null,3,{"$f":"IF(AB12>$D$22,0,AF11)","v":4.4401271523178805},{"$f":"IF(AB12>$D$22,0,$AD$6/$D$22)","v":2.2200635761589402},4.9951430463576148E-2,6.6601907284768203,null,3,{"$f":"IF(AH12>$D$22,0,AL11)","v":2.9600847682119205},{"$f":"IF(AH12>$D$22,0,$AJ$6/$D$22)","v":1.4800423841059602},{"$f":"SUM(AI12:AJ12)*($O$24/12)","v":5.1801483443708607E-2},{"$f":"AI12+AJ12","v":4.4401271523178805}]
["PDC",{"$f":"Dashboard!D19","v":0.02},null,{"$f":"B13*D11","v":1.008},null,null,null,null,null,null,"Local Financing Rate",null,null,null,{"$f":"Dashboard!D40","v":0.15},null,null,null,null,null,null,4,6.6601907284768203,2.2200635761589402,0.11100317880794701,8.8802543046357609,null,4,6.6601907284768203,2.2200635761589402,6.6601907284768211E-2,8.8802543046357609,null,4,4.4401271523178805,1.4800423841059602,6.9068644591611481E-2,5.9201695364238409]
["Land",null,null,{"$f":"Dashboard!D20","v":2.75},null,null,null,null,null,null,"Tenor",null,null,null,{"$f":"Dashboard!D41","v":15},null,null,null,null,null,null,5,8.8802543046357609,2.2200635761589402,0.13875397350993376,11.100317880794702,null,5,8.8802543046357609,2.2200635761589402,8.3252384105960253E-2,11.100317880794702,null,5,5.9201695364238409,1.4800423841059602,8.6335805739514354E-2,7.4002119205298014]
["Insurance during construction",{"$f":"Dashboard!D21","v":4.0000000000000001E-3},null,{"$f":"B15*D11","v":0.2016},null,null,null,null,null,null,"Qtr. Installment",null,null,4,{"$f":"O14*N15","v":60},null,null,null,null,null,null,6,11.100317880794702,2.2200635761589402,0.16650476821192051,13.320381456953642,null,6,11.100317880794702,2.2200635761589402,9.9902860927152309E-2,13.320381456953642,null,6,7.4002119205298014,1.4800423841059602,0.10360296688741721,8.8802543046357609]
["CAPEX",null,null,{"$f":"SUM(D11:D15)","v":55.871600000000001},null,null,null,null,null,null,null,null,null,null,null,null,null,null,null,null,null,7,13.320381456953642,2.2200635761589402,0.19425556291390728,15.540445033112583,null,7,13.320381456953642,2.2200635761589402,0.11655333774834437,15.540445033112583,null,7,8.8802543046357609,1.4800423841059602,0.12087012803532009,10.360296688741721]
["Financing fees",{"$f":"Dashboard!D22","v":0.02},null,{"$f":"D19*B17*B26","v":0.88802543046357618},null,null,null,null,null,null,"SoFR ",null,null,"base",4.6800000000000001E-2,null,null,null,null,null,null,8,15.540445033112583,2.2200635761589402,0.22200635761589402,17.760508609271522,null,8,15.540445033112583,2.2200635761589402,0.13320381456953642,17.760508609271522,null,8,10.360296688741721,1.4800423841059602,0.13813728918322296,11.840339072847682]
["IDC",null,null,{"$f":"AE64+Y64","v":2.4420699337748339},null,null,null,null,null,null,"Credit Adjustment Spread",null,null,null,0,null,null,null,null,null,null,9,17.760508609271522,2.2200635761589402,0.24975715231788073,19.980572185430461,null,9,17.760508609271522,2.2200635761589402,0.14985429139072845,19.980572185430461,null,9,11.840339072847682,1.4800423841059602,0.15540445033112582,13.320381456953642]
["Total Project Cost",null,{"$f":"D19/$D$3","v":0.49334746136865343},{"$f":"SUM(D17:D18)+D16","v":59.201695364238411},null,null,null,null,null,null,"Spread ",null,null,null,4.2500000000000003E-2,null,null,null,null,null,null,10,19.980572185430461,2.2200635761589402,0.27750794701986747,22.2006357615894,null,10,19.980572185430461,2.2200635761589402,0.16650476821192048,22.2006357615894,null,10,13.320381456953642,1.4800423841059602,0.17267161147902871,14.800423841059603]
[null,null,null,null,null,null,null,null,null,null,"Foreign Financing Rate",null,null,null,{"$f":"Dashboard!D43","v":0.09},null,null,null,null,null,null,11,0,0,0,0,null,11,{"$f":"IF(AB20>$D$22,0,AF19)","v":0},{"$f":"IF(AB20>$D$22,0,$AD$6/$D$22)","v":0},{"$f":"SUM(AC20:AD20)*($O$20/12)","v":0},{"$f":"AC20+AD20","v":0},null,11,0,0,0,0]
[null,null,null,null,null,null,null,null,null,null,"Tenor",null,null,null,{"$f":"Dashboard!D44","v":15},null,null,null,null,null,null,12,0,0,0,0,null,12,0,0,0,0,null,12,0,0,0,0]
["Construction Period","months",null,{"$f":"Dashboard!D23","v":10},null,null,null,null,null,null,"Qtr. Installment",null,null,4,{"$f":"O21*N22","v":60},null,null,null,null,null,null,13,0,0,0,0,null,13,0,0,0,0,null,13,0,0,0,0]
[null,null,null,null,null,null,null,null,null,null,null,null,null,null,null,null,null,null,null,null,null,14,0,0,0,0,null,14,0,0,0,0,null,14,0,0,0,0]
["Capital Structure",null,null,null,null,null,null,null,null,null,"ROE ",null,null,null,{"$f":"Dashboard!D46","v":0.14000000000000001},null,null,null,null,null,null,15,0,0,0,0,null,15,0,0,0,0,null,15,0,0,0,0]
[null,null,null,null,null,null,null,null,null,null,"Exchange. Rate",null,null,null,{"$f":"Dashboard!D47","v":278},null,null,null,null,null,null,16,0,0,0,0,null,16,0,0,0,0,null,16,0,0,0,0]
["Debt",{"$f":"Dashboard!D27","v":0.75},null,{"$f":"$B26*D19","v":44.401271523178806},null,null,null,null,null,null,"Discount Rate",null,null,null,{"$f":"(O13*B28*B26)+(O20*B27*B26)+(O24*B29)","v":0.125},null,null,null,null,null,null,17,0,0,0,0,null,17,0,0,0,0,null,17,0,0,0,0]
["Foreign",{"$f":"Dashboard!D30","v":0.5},null,{"$f":"$B27*D$26","v":22.200635761589403},null,null,null,null,null,null,"Project Life",null,null,null,25,null,null,null,null,null,null,18,0,0,0,0,null,18,0,0,0,0,null,18,0,0,0,0]
["Local",{"$f":"1-B27","v":0.5},null,{"$f":"$B28*D$26","v":22.200635761589403},null,null,null,null,null,null,null,null,null,null,null,null,null,null,null,null,null,19,0,0,0,0,null,19,0,0,0,0,null,19,0,0,0,0]
["Equity",{"$f":"1-B26","v":0.25},null,{"$f":"$B29*D19","v":14.800423841059603},null,null,null,null,null,null,null,null,null,null,null,null,null,null,null,null,null,20,0,0,0,0,null,20,0,0,0,0,null,20,0,0,0,0]
[null,null,null,null,null,null,null,null,null,null,null,null,null,null,null,null,null,null,null,null,null,21,0,0,0,0,null,21,0,0,0,0,null,21,0,0,0,0]
["Tariff",null,null,null,null,null,null,null,null,null,null,null,null,null,null,null,null,null,null,null,null,22,0,0,0,0,null,22,0,0,0,0,null,22,0,0,0,0]
[null,null,null,null,null,null,null,null,null,null,null,null,null,null,null,null,null,null,null,null,null,23,0,0,0,0,null,23,0,0,0,0,null,23,0,0,0,0]
[null,null,"Solar ",null,null,null,null,null,null,null,null,null,null,null,null,null,null,null,null,null,null,24,0,0,0,0,null,24,0,0,0,0,null,24,0,0,0,0]
[null,null,null,null,null,null,null,null,null,null,null,null,null,null,null,null,null,null,null,null,null,25,0,0,0,0,null,25,0,0,0,0,null,25,0,0,0,0]
[null,null,"USD'000","Rs./kWh",null,null,null,null,null,null,null,null,null,null,null,null,null,null,null,null,null,26,0,0,0,0,null,26,0,0,0,0,null,26,0,0,0,0]
["Fixed O&M - Local",{"$f":"Dashboard!D35","v":9000},{"$f":"B36*D3/1000","v":1080},{"$f":"(C36*$O$25)/(D5)","v":1.1900684931506849},null,null,null,null,null,null,null,null,null,null,null,null,null,null,null,null,null,27,0,0,0,0,null,27,0,0,0,0,null,27,0,0,0,0]
["Fixed O&M - Foreign",null,{"$f":"$E$23*B37/1000","v":0},{"$f":"(C37*$O$25)/(D5)","v":0},null,null,null,null,null,null,null,null,null,null,null,null,null,null,null,null,null,28,0,0,0,0,null,28,0,0,0,0,null,28,0,0,0,0]
["Insurance",{"$f":"Dashboard!D36","v":4.0000000000000001E-3},{"$f":"D11*$B$38*1000","v":201.6},{"$f":"(C38*$O$25)/($D$5)","v":0.22214611872146117},null,null,null,null,null,null,null,null,null,null,null,null,null,null,null,null,null,29,0,0,0,0,null,29,0,0,0,0,null,29,0,0,0,0]
["ROE",null,{"$f":"$O$24*D29*1000","v":2072.0593377483447},{"$f":"(C39*$O$25)/($D$5)","v":2.2832338275860917},null,null,null,null,null,null,null,null,null,null,null,null,null,null,null,null,null,30,0,0,0,0,null,30,0,0,0,0,null,30,0,0,0,0]
["ROEDC",null,{"$f":"AK64*1000","v":949.69386313465782},{"$f":"-PMT(O24,O27,(C40*O25/D5),)","v":0.15226148981185869},null,null,null,null,null,null,null,null,null,null,null,null,null,null,null,null,null,31,0,0,0,0,null,31,0,0,0,0,null,31,0,0,0,0]
{"$rows_left_out":133}